AliRoot v4-13-Rev-06

environment

  • ROOT v5-21-01-alice
  • Geant3: v1-9
  • alilogin v4-13-Rev-06

Debian Sarge, gcc335-13 (32bit)

GSL:

  • /d/alice01/alisoft/PPR/debian3.1/i686/gcc335-13/alice/GSL/gsl-1.11

libxml2

  • /d/alice01/alisoft/PPR/debian3.1/i686/gcc335-13/alice/XML2/libxml2-2.6.32

ROOT

#! /bin/sh

# QT login before compiling
. /usr/local/bin/qtlogin 303-04

# oracle login:
. /usr/local/bin/oraenv

export EVGEN_NEW=/usr/local/pub/$GSI_OS_FLAVOR$GSI_OS_VERSION/$GSI_COMPILER_CC/sim/evgen
# export XMLDIR=$VERSIONPATH/rootmgr/libxml/libxml2-2.6.9

export VERSIONPATH=/usr/local/pub/debian3.1/gcc335-13/rootmgr
export VP2=/usr/local/pub/debian$GSI_OS_VERSION/$(uname -m)/$GSI_COMPILER_CC
export VP2a=/d/alice01/alisoft/PPR/debian$GSI_OS_VERSION/$(uname -m)/$GSI_COMPILER_CC

cd $ROOTSYS

if [ ! -d $ROOTSYS/lib ]; then
  mkdir -p $ROOTSYS/lib
fi

#cp $EVGEN_NEW/Pythia5/libPythia.so $ROOTSYS/lib
# cp $EVGEN_NEW/Pythia6_new/pythia6/libPythia6.so $ROOTSYS/lib/
cp $EVGEN_NEW/Venus/libVenus.so $ROOTSYS/lib

# touch lib/libPythia.so lib/libPythia6.so lib/libVenus.so

RFIODIR=/GSI/staging/adsm/v51

./configure linux       --enable-soversion --enable-opengl --enable-rfio --enable-xml\
    --enable-alien \
    --build=debug \
    --enable-qtgsi \
    --disable-globus \
    --enable-fftw3 \
    --enable-cern \
    --enable-mathmore \
    --enable-mathcore \
    --enable-roofit \
    --enable-asimage \
    --enable-minuit2 \
    --enable-table \
    --enable-glite \
    --with-fftw3-libdir=$VP2a/alice/FFTW3/fftw-3.1.2/lib \
    --with-fftw3-incdir=$VP2a/alice/FFTW3/fftw-3.1.2/include \
    --with-thread-libdir=/usr/lib/\
    --with-pythia6-uscore=SINGLE \
    --with-ldap-incdir=$VERSIONPATH/openldap/include \
    --with-ldap-libdir=$VERSIONPATH/openldap/lib \
    --with-rfio-libdir=$RFIODIR/Linux \
    --with-rfio-incdir=$RFIODIR/inc \
    --with-alien-incdir=$VP2/alice/alien/v2-15/api/include \
    --with-alien-libdir=$VP2/alice/alien/v2-15/api/lib \
    --with-cern-libdir=/usr/local/cern/2005-sarge-32/lib \
    --with-oracle-incdir=$ORACLE_HOME/rdbms/public --with-oracle-libdir=$ORACLE_HOME/lib \
    --with-ssl-incdir=$VP2/alice/alien/v2-15/include \
    --with-ssl-libdir=$VP2/alice/alien/v2-15/lib \
    --with-xml-incdir=$VP2a/alice/XML2/libxml2-2.6.32/include \
    --with-xml-libdir=$VP2a/alice/XML2/libxml2-2.6.32/.libs \
    --with-gsl-incdir=$VP2a/alice/GSL/gsl-1.11/include \
    --with-gsl-libdir=$VP2a/alice/GSL/gsl-1.11/lib \
    --with-f77=f77

  • modifications needed in config/Makefile.config
    • RFIO
BUILDRFIO      := yes
SHIFTLIBDIR    := -L/GSI/staging/adsm/v51/Linux/
SHIFTLIB       := -lshift -lnsl
SHIFTINCDIR    := /GSI/staging/adsm/v51/inc /usr/local/pub/debian3.1/gcc335-13/castor/h
SHIFTCFLAGS    := -DR__CASTOR2

    • FFTW3
BUILDFFTW3     := yes
FFTW3LIBDIR    := -L/usr/local/pub/debian3.1/gcc335-13/fftw/lib
FFTW3LIB       := -lfftw3
FFTW3INCDIR    := $(filter-out /usr/include, /usr/local/pub/debian3.1/gcc335-13/fftw/include)

change also in configure script:
   --with-fftw3-libdir=/usr/local/pub/debian3.1/gcc335-13/fftw/lib \
    --with-fftw3-incdir=/usr/local/pub/debian3.1/gcc335-13/fftw/include \

  • cd $ROOTSYS, gmake
bin/rmkdepend -R -froofit/roofitcore/src/RooSimWSTool.d -Y -w 1000 -- -pipeoofit/roofitcore/src/RooSimWSTool.cxx
g++ -g -pipe -m32 -Wall -W -Woverloaded-virtual -fPIC -Iinclude  -pthreadx
In file included from roofit/roofitcore/src/RooSimWSTool.cxx:95:
/usr/include/c++/3.3/bits/stl_pair.h: In instantiation of `std::pair<const
/usr/include/c++/3.3/bits/stl_tree.h:123:   instantiated from `std::_Rb_tre
/usr/include/c++/3.3/bits/stl_alloc.h:242:   instantiated from `static voidd::_Rb_tree_node<std::pair<const std::string, RooSimWSTool::SplitRule> >, _
/usr/include/c++/3.3/bits/stl_tree.h:567:   instantiated from `void std::_Rth _Tp = std::pair<const std::string, RooSimWSTool::SplitRule>, _Alloc = st
/usr/include/c++/3.3/bits/stl_tree.h:580:   instantiated from `std::_Rb_treooSimWSTool::SplitRule>, _Alloc = std::allocator<std::pair<const std::strin
/usr/include/c++/3.3/bits/stl_tree.h:748:   instantiated from `std::_Rb_treng, _Val = std::pair<const std::string, RooSimWSTool::SplitRule>, _KeyOfValompare = std::less<std::string>, _Alloc = std::allocator<std::pair<const st
include/RooSimWSTool.h:82:   instantiated from here
/usr/include/c++/3.3/bits/stl_pair.h:74: error: `std::pair<_T1, _T2>::secon
   has incomplete type
include/RooSimWSTool.h:45: error: forward declaration of `struct
   RooSimWSTool::SplitRule'
roofit/roofitcore/src/RooSimWSTool.cxx: In member function `
   RooSimWSTool::ObjBuildConfig*
   RooSimWSTool::validateConfig(RooSimWSTool::BuildConfig&)':
roofit/roofitcore/src/RooSimWSTool.cxx:204: error: 'struct std::pair<const
   std::string, RooSimWSTool::SplitRule>' has no member named 'second'
roofit/roofitcore/src/RooSimWSTool.cxx:207: error: 'struct std::pair<const
   std::string, RooSimWSTool::SplitRule>' has no member named 'second'
roofit/roofitcore/src/RooSimWSTool.cxx:216: error: 'struct std::pair<const
   std::string, RooSimWSTool::SplitRule>' has no member named 'second'
/usr/include/c++/3.3/bits/stl_map.h: In member function `_Tp& std::map<_Key
   _Tp, _Compare, _Alloc>::operator[](const _Key&) [with _Key = std::string
   _Tp = RooSimWSTool::SplitRule, _Compare = std::less<std::string>, _Alloc
   std::allocator<std::pair<const std::string, RooSimWSTool::SplitRule> >]'
roofit/roofitcore/src/RooSimWSTool.cxx:717:   instantiated from here
/usr/include/c++/3.3/bits/stl_map.h:320: error: 'struct std::pair<const
   std::string, RooSimWSTool::SplitRule>' has no member named 'second'
/usr/include/c++/3.3/bits/stl_pair.h: In constructor `std::pair<_T1,
   _T2>::pair(const _T1&, const _T2&) [with _T1 = const std::string, _T2 =
   RooSimWSTool::SplitRule]':
/usr/include/c++/3.3/bits/stl_map.h:319:   instantiated from `_Tp& std::map _Tp = RooSimWSTool::SplitRule, _Compare = std::less<std::string>, _Alloc =
roofit/roofitcore/src/RooSimWSTool.cxx:717:   instantiated from here
/usr/include/c++/3.3/bits/stl_pair.h:84: error: unnamed initializer for `
   std::pair<const std::string, RooSimWSTool::SplitRule>', which has no bas
   classes
gmake: *** [roofit/roofitcore/src/RooSimWSTool.o] Error 1

  • try with Debian Etch

Debian Etch, gcc411-21 (32bit)

GSL:

  • /d/alice01/alisoft/PPR/debian4.0/i686/gcc411-21/alice/GSL/gsl-1.11

libxml2

  • /d/alice01/alisoft/PPR/debian4.0/i686/gcc411-21/alice/XML2/libxml2-2.6.32

ROOT

#! /bin/sh

# QT login before compiling
. /usr/local/bin/qtlogin 303-04

# oracle login:
. /usr/local/bin/oraenv

export EVGEN_NEW=/usr/local/pub/$GSI_OS_FLAVOR$GSI_OS_VERSION/$GSI_COMPILER_CC/sim/evgen
# export XMLDIR=$VERSIONPATH/rootmgr/libxml/libxml2-2.6.9

export VERSIONPATH=/usr/local/pub/debian3.1/gcc335-13/rootmgr
export VP2=/usr/local/pub/debian$GSI_OS_VERSION/$(uname -m)/$GSI_COMPILER_CC
export VP2a=/d/alice01/alisoft/PPR/debian$GSI_OS_VERSION/$(uname -m)/$GSI_COMPILER_CC

cd $ROOTSYS

if [ ! -d $ROOTSYS/lib ]; then
  mkdir -p $ROOTSYS/lib
fi

#cp $EVGEN_NEW/Pythia5/libPythia.so $ROOTSYS/lib
# cp $EVGEN_NEW/Pythia6_new/pythia6/libPythia6.so $ROOTSYS/lib/
cp $EVGEN_NEW/Venus/libVenus.so $ROOTSYS/lib

# touch lib/libPythia.so lib/libPythia6.so lib/libVenus.so

RFIODIR=/GSI/staging/adsm/v51

./configure linux       --enable-soversion --enable-opengl --enable-rfio --enable-xml\
    --enable-alien \
    --build=debug \
    --enable-qtgsi \
    --disable-globus \
    --enable-fftw3 \
    --enable-cern \
    --enable-mathmore \
    --enable-mathcore \
    --enable-roofit \
    --enable-asimage \
    --enable-minuit2 \
    --enable-table \
    --enable-glite \
    --with-fftw3-libdir=$VP2a/alice/FFTW3/fftw-3.1.2/lib \
    --with-fftw3-incdir=$VP2a/alice/FFTW3/fftw-3.1.2/include \
    --with-thread-libdir=/usr/lib/\
    --with-pythia6-uscore=SINGLE \
    --with-ldap-incdir=$VERSIONPATH/openldap/include \
    --with-ldap-libdir=$VERSIONPATH/openldap/lib \
    --with-rfio-libdir=$RFIODIR/Linux \
    --with-rfio-incdir=$RFIODIR/inc \
    --with-alien-incdir=$VP2/alice/alien/v2-15/api/include \
    --with-alien-libdir=$VP2/alice/alien/v2-15/api/lib \
    --with-cern-libdir=/usr/local/cern/2005-sarge-32/lib \
    --with-oracle-incdir=$ORACLE_HOME/rdbms/public --with-oracle-libdir=$ORACLE_HOME/lib \
    --with-ssl-incdir=$VP2/alice/alien/v2-15/include \
    --with-ssl-libdir=$VP2/alice/alien/v2-15/lib \
    --with-xml-incdir=$VP2a/alice/XML2/libxml2-2.6.32/include \
    --with-xml-libdir=$VP2a/alice/XML2/libxml2-2.6.32/.libs \
    --with-gsl-incdir=$VP2a/alice/GSL/gsl-1.11/include \
    --with-gsl-libdir=$VP2a/alice/GSL/gsl-1.11/lib \
    --with-f77=f77

  • modifications needed in config/Makefile.config
    • RFIO
BUILDRFIO      := yes
SHIFTLIBDIR    := -L/GSI/staging/adsm/v51/Linux
SHIFTLIB       := -lshift -lnsl
SHIFTINCDIR    := /GSI/staging/adsm/v51/inc /usr/local/pub/debian3.1/gcc335-13/castor/h
SHIFTCFLAGS    := -DR__CASTOR2

  • cd $ROOTSYS, gmake

sql/mysql/src/TMySQLServer.cxx: At global scope:
sql/mysql/src/TMySQLServer.cxx:648: warning: unused parameter 'sql'
gmake: *** [sql/mysql/src/TMySQLServer.o] Error 1

    • without TMySQL

lib/libminicern.so: undefined reference to `G77_lnblnk_0'
lib/libminicern.so: undefined reference to `i_indx'
lib/libminicern.so: undefined reference to `do_fio'
lib/libminicern.so: undefined reference to `e_wsfi'
lib/libminicern.so: undefined reference to `s_cat'
lib/libminicern.so: undefined reference to `s_wsfi'
lib/libminicern.so: undefined reference to `e_rdue'
lib/libminicern.so: undefined reference to `f_clos'
lib/libminicern.so: undefined reference to `f_open'
lib/libminicern.so: undefined reference to `s_wsle'
lib/libminicern.so: undefined reference to `s_wsfe'
lib/libminicern.so: undefined reference to `s_copy'

    • reason: there is not F77 flag as f77. Only gfortran and g77 are foreseen.
Fix: in config/Makefile.linux
ifneq ($(findstring f77, $(F77)),)
F77           = f77
F77FLAGS      = -m32 -fPIC
ifneq ($(shell $(F77) -print-file-name=libg2c.so),libg2c.so)
F77LIBS      := $(shell $(F77) -m32 -print-file-name=libg2c.so) -lnsl
else
F77LIBS      := $(shell $(F77) -m32 -print-file-name=libg2c.a) -lnsl
endif
endif

  • ROOT Grid tests: ok
  • rootlogin: ok

Geant3

GSILIB

  • GSILIB=/usr/local/pub/debian4.0/i686/gcc411-21/rootmgr/gsilibs/521-01-alice
  • request and storage queue

AliRoot

Fluka

  • current version: FLUKA 2006.3b
  • error: /d/alice01 not accessible: Ticket
  • FLUPRO=/usr/local/pub/debian4.0/i686/gcc411-21/alice/Fluka/2006.3b
  • cd $ALICE_ROOT, gmake all-TFluka

transport tests

  • gSystem->Load("libTFluka.so")
  • gSystem->Load("libdpmjet.so")
  • gSystem->Load("libgeant321.so")
  • ppbench
        creating summable digits for MUON R:7.3832s C:0.4900s (1 slices)
        creating summable digits for PHOS R:2.0439s C:0.2500s (1 slices)
        creating summable digits for PMD R:5.3355s C:3.6800s (1 slices)
        creating summable digits for T0 R:0.0120s C:0.0000s (1 slices)
        creating summable digits for TOF R:2.1651s C:0.3400s (1 slices)
        creating summable digits for TRD R:41.3403s C:38.8100s (1 slices)
        creating summable digits for VZERO R:0.0122s C:0.0000s (1 slices)
        creating summable digits for ZDC R:1.7158s C:0.1300s (1 slices)
   RunSimulation  R:1743.3432s C:1707.4500s (1 slices)
   RunTrigger  R:20.5607s C:2.6400s (1 slices)
   WriteRawData  R:359.9093s C:254.3600s (1 slices)
   WriteRawFiles  R:263.3001s C:250.0800s (1 slices)
Error: Symbol G__exception is not defined in current scope  sim.C:9:
Error: type G__exception not defined FILE:/tmp/ppbench-v4-13-Rev-06/./sim.C LINE:9
*** Interpreter error recovered ***
terminate called after throwing an instance of 'std::bad_alloc'
  what():  St9bad_alloc
Aborted

but with debugger it works fine:
AliSimulation
   ConvertRawFilesToDate  R:5.4127s C:1.8400s (1 slices)
   Run  R:3505.4461s C:3241.1300s (1 slices)
   RunDigitization  R:119.3429s C:51.6200s (1 slices)
   RunHitsDigitization  R:1180.8468s C:1173.3700s (1 slices)
   RunSDigitization 
         R:73.4946s C:45.8500s (1 slices)
        creating summable digits for EMCAL R:2.2399s C:0.3100s (1 slices)
        creating summable digits for FMD R:1.5519s C:0.5000s (1 slices)
        creating summable digits for HMPID R:2.9478s C:0.1800s (1 slices)
        creating summable digits for MUON R:7.2914s C:0.4400s (1 slices)
        creating summable digits for PHOS R:2.2516s C:0.2400s (1 slices)
        creating summable digits for PMD R:5.3556s C:3.4700s (1 slices)
        creating summable digits for T0 R:0.0118s C:0.0000s (1 slices)
        creating summable digits for TOF R:2.2299s C:0.3500s (1 slices)
        creating summable digits for TRD R:40.9443s C:38.7300s (1 slices)
        creating summable digits for VZERO R:0.0118s C:0.0000s (1 slices)
        creating summable digits for ZDC R:1.6997s C:0.1100s (1 slices)
   RunSimulation  R:1742.1021s C:1705.2200s (1 slices)
   RunTrigger  R:19.9805s C:2.6300s (1 slices)
   WriteRawData  R:357.8447s C:252.0100s (1 slices)
   WriteRawFiles  R:263.8404s C:247.9100s (1 slices)
root [1] 

PAR files

  • cd $ALICE_ROOT, gmake
ANALYSISalice.par  ANALYSIS.par  AOD.par  ESD.par  STEERBase.par

Calibration DB

  • Alien: /alice/simulation/2008/v4-13-Release/

 .alienv215rootlogin
alien proxy-init
alien-token-init kschwarz
source /tmp/gclient_env_$UID

AliCDBManager* man = AliCDBManager::Instance();
man->SetDefaultStorage("alien://folder=/alice/simulation/2008/v4-10-Release/Full/")
man->SetDrain("local://$ALICE_ROOT/CDB/Full")
AliCDBStorage* sto = man->GetDefaultStorage()
sto->GetAll("*",0)

same with Ideal and Residual.

htmldoc

  • gmake htmldoc

update Webpage

  • ln -s /usr/local/pub/debian4.0/i686/gcc411-21/alice/AliRoot/v4-13-Rev-06 /usr/local/pub/debian3.1/i686/gcc335-13/alice/AliRoot/v4-13-Rev-06
  • ln -s /usr/local/pub/debian3.1/i686/gcc335-13/alice/AliRoot/v4-13-Rev-06 /misc/kschwarz/web-docs/AliRoot/v4-13-Rev-06
  • cd html/roothtml
  • ln -s ClassIndex?.html USER_Index.html
  • update /misc/kschwarz/web-docs/aliroot.html
    • currently not working

Debian Etch, gcc411-21 (64bit)

GSL:

  • /d/alice01/alisoft/PPR/debian4.0/x86_64/gcc411-21/alice/gsl/gsl-1.11

libxml2

  • /d/alice01/alisoft/PPR/debian4.0/x86_64/gcc411-21/alice/xml/libxml2-2.6.32

ROOT

#! /bin/sh

# QT login before compiling
. /usr/local/bin/qtlogin 303-04

# oracle login:
. /usr/local/bin/oraenv

export EVGEN_GEN=/usr/local/pub/$GSI_OS_FLAVOR$GSI_OS_VERSION/$GSI_COMPILER_CC/sim/evgen
export EVGEN=/usr/local/pub/$GSI_OS_FLAVOR$GSI_OS_VERSION/$(uname -m)/$GSI_COMPILER_CC/sim/evgen
# export XMLDIR=/usr/local/pub/debian3.0/gcc323-00/rootmgr/libxml/libxml2-2.6.9
export VERSIONPATH=/usr/local/pub/debian3.1/gcc335-13/rootmgr
export VP2=/usr/local/pub/debian$GSI_OS_VERSION/$(uname -m)/$GSI_COMPILER_CC
export VP2a=/d/alice01/alisoft/PPR/debian$GSI_OS_VERSION/$(uname -m)/$GSI_COMPILER_CC
cd $ROOTSYS

if [ ! -d $ROOTSYS/lib ]; then
  mkdir -p $ROOTSYS/lib
fi
cp $EVGEN_GEN/venus/libVenus.so $ROOTSYS/lib
export RFIODIR=/GSI/staging/adsm/v51/
./configure        --enable-soversion --enable-opengl --enable-rfio --enable-xml\
    --enable-alien\
    --build=debug\
    --enable-qtgsi\
    --disable-globus\
    --enable-fftw3\
    --enable-cern \
    --enable-mathmore \
    --enable-mathcore \
    --enable-roofit \
    --enable-asimage --enable-minuit2 \
    --enable-table \
    --with-fftw3-libdir=$VP2a/alice/FFTW3/fftw-3.1.2/lib \
    --with-fftw3-incdir=$VP2a/alice/FFTW3/fftw-3.1.2/include \
    --with-thread-libdir=/usr/lib/\
    --with-pythia6-uscore=SINGLE \
   --with-ldap-incdir=$VERSIONPATH/openldap/include \
    --with-ldap-libdir=$VERSIONPATH/openldap/lib \
    --with-shift-libdir=$RFIODIR/Linux \
    --with-rfio-libdir=$RFIODIR/Linux \
    --with-rfio-incdir=$RFIODIR/inc \
    --with-alien-incdir=$VP2/alice/alien/v2-15/api/include \
    --with-alien-libdir=$VP2/alice/alien/v2-15/api/lib \
    --with-oracle-incdir=$ORACLE_HOME/rdbms/public \
    --with-oracle-libdir=$ORACLE_HOME/lib \
    --with-ssl-incdir=$VP2/alice/alien/v2-15/include \
    --with-ssl-libdir=$VP2/alice/alien/v2-15/lib \
    --with-xml-incdir=$VP2a/alice/xml/libxml2-2.6.32/include \
    --with-xml-libdir=$VP2a/alice/xml/libxml2-2.6.32/.libs \
    --with-gsl-incdir=$VP2a/alice/gsl/gsl-1.11/include \
    --with-gsl-libdir=$VP2a/alice/gsl/gsl-1.11/lib \
    --with-f77=g77

  • modifications needed in config/Makefile.config
    • RFIO
BUILDRFIO      := yes
SHIFTLIBDIR    := -L/GSI/staging/adsm/v51/Linux64
SHIFTLIB       := -lrawapiclin64 -lrawservn64
SHIFTINCDIR    := /GSI/staging/adsm/v51/inc /usr/local/pub/debian3.1/gcc335-13/castor/h
SHIFTCFLAGS    := -DR__CASTOR2
* QTGSI
BUILDQTGSI     := no
QTLIBDIR       := yes
QTLIB          := -lqt-mt
QTINCDIR       := $(filter-out /usr/include, /usr/include/qt3)
QTVERS         := 3
QTMOCEXE       := /usr/bin/moc-qt3

  • cd $ROOTSYS, gmake

sql/mysql/src/TMySQLServer.cxx: At global scope:
sql/mysql/src/TMySQLServer.cxx:648: warning: unused parameter 'sql'
gmake: *** [sql/mysql/src/TMySQLServer.o] Error 1

    • without TMySQL

  • ROOT Grid tests: ok
  • rootlogin: ok

Geant3

GSILIB

  • request and storage queue

AliRoot

transport tests

  • gSystem->Load("libdpmjet.so")
  • gSystem->Load("libgeant321.so")
  • ppbench
rec.log:
I-AliReconstruction::RunVertexFinder: running the ITS vertex finder
I-AliReconstruction::RunMuonTracking: is running...
I-AliMUONDigitMaker::CreateRawStreamTracker: Using fast decoder.
I-AliMUONTracker::AliMUONTracker: No cluster server given. Will use AliMUONLegacyClusterServer
I-AliMUONTracker::LoadClusters: Created AliMUONClusterStoreV2 from cluster tree
I-AliMUONTracker::CreateTrackReconstructor: Will use AliMUONTrackReconstructorK for tracking
I-AliReconstruction::RunTracking: running tracking
Ncandidates=    0       0       7       96
Real time 0:00:00, CP time 0.000
I-AliTPCtrackerMI::FindSplitted: Time for splitted tracks removal
Real time 0:00:00, CP time 0.000
I-AliTPCtrackerMI::Clusters2Tracks: Number of found tracks 7
Number of filled ESDs-  7
I-AliITStrackerSA::Clusters2Tracks: Number of ESD tracks: 7

I-AliITStrackerSA::Clusters2Tracks: Number of prolonged tracks: 2

I-AliITStrackerSA::FindTracks: Number of found tracks: 7
I-AliITStrackerSA::PropagateBack: Number of ESD tracks: 7

I-AliITStrackerSA::PropagateBack: Number of back propagated ITS tracks: 2

I-AliTPCtrackerMI::FindSplitted: Time for splitted tracks removal
Real time 0:00:00, CP time 0.000

 *** Break *** segmentation violation
I-AliTPCtrackerMI::PropagateBack: Number of back propagated tracks 7
I-AliTRDtrackerV1::LoadClusters: Clusters 413 in 100.00 %
I-AliTRDtrackerV1::PropagateBack: Number of seeds: 7
I-AliTRDtrackerV1::PropagateBack: Number of back propagated TRD tracks: 4
I-AliTOFtracker::LoadClusters: Number of clusters: 4
I-AliTOFtracker::CollectESD: Number of TOF seeds 4
I-AliTOFtracker::CollectESD: Number of TOF seeds Type 1 0
I-AliTOFtracker::CollectESD: Number of TOF seeds Type 2 4
I-AliTOFtracker::PropagateBack: Number of matched tracks: 0
I-AliTOFtracker::PropagateBack: Number of good matched tracks: 0
I-AliTOFtracker::PropagateBack: Number of bad  matched tracks: 0
I-AliPHOSTracker::LoadClusters: Number of loaded clusters: 0
I-AliPHOSTracker::PropagateBack: Number of matched tracks: 0
W-AliEMCALTracker::LoadClusters: No clusters collected
I-AliEMCALTracker::LoadClusters: Collected 0 clusters (RecPoints)
W-AliEMCALTracker::LoadClusters: No clusters collected
I-AliEMCALTracker::LoadClusters: Collected 0 clusters from ESD
I-AliEMCALTracker::LoadTracks: Collected 2 tracks
I-AliEMCALTracker::PropagateBack: #clusters = 0 -- #tracks = 2 --> No good matches found.
I-AliTOFtracker::LoadClusters: Number of clusters: 4

  • info an alice offline

PAR files

  • cd $ALICE_ROOT, gmake
ANALYSISalice.par  ANALYSIS.par  AOD.par  ESD.par  STEERBase.par

Calibration DB: see 32bit

Webpage: see 32bit

-- KilianSchwarz - 29 Jul 2008
Topic revision: r18 - 2008-08-29, KilianSchwarz
 
This site is powered by FoswikiCopyright © by the contributing authors. All material on this collaboration platform is the property of the contributing authors.
Ideas, requests, problems regarding GSI Wiki? Send feedback
Imprint (in German)
Privacy Policy (in German)